{"text_format":"1","workbook":"xlsx","n_sheets":3,"sheets":["Main Page","Template Model","Donnés"],"not_rendered":{"charts":0,"images":2,"macros":1,"external_links":0,"defined_names":0,"comments":0,"pivot_tables":0},"unopened":[],"bounds":{"document_bytes":16777216,"sheet_cells":100000,"rows_first":2000,"rows_last":500,"rows_between":2000,"halvings":0,"cell_chars":16384,"cell_head_chars":4096},"cells_cut":0,"cells_raw":0,"read":"whole","date_system":"1900"}

{"sheet":"Main Page","index":0,"n_rows":4,"n_cols":3,"rows_kept":4,"cut":false,"hidden":false,"merged":[[1,1,1,2]]}
[]
[null,"COMPETITION RANKING"]
[]
[null,"TEAM NAME","SCORE"]

{"sheet":"Template Model","index":1,"n_rows":54,"n_cols":6,"rows_kept":54,"cut":false,"hidden":true,"merged":[[6,0,7,0],[6,1,7,1]]}
["Summary table"]
[]
["Team name"]
["Number of MAVS",null,null,null,null,"MAV 1"]
["Presentation Factor","(P)",null,null,"SIZE (m)",1]
[0,{"$f":"VLOOKUP(A6,Donnés!A18:B28,2,FALSE)","v":1},null,null,"(S)",{"$f":"1/F5","v":1}]
["Final score",null,null,null,"MISSION ELEMENTS"]
[null,null,null,null,"Automatic Take-off"]
[null,null,null,null,"Take-off","NO"]
[null,null,null,null,"Level of autonomy","Video based control"]
[null,null,null,null,"External aids","NO"]
[null,null,null,null,"In a row Bonus","NO"]
[null,null,null,null,"Mission score",{"$f":"VLOOKUP(F9,Donnés!$E$2:$F$3,2,FALSE)*(VLOOKUP(F10,Donnés!$A$9:$B$12,2,FALSE)+VLOOKUP(F11,Donnés!$A$14:$B$15,2,FALSE))*F6","v":0}]
[null,null,null,null,"Flight Performance "]
[null,null,null,null,"Number of Laps",0]
[null,null,null,null,"Level of autonomy","Video based control"]
[null,null,null,null,"External aids","NO"]
[null,null,null,null,"In a row Bonus","NO"]
[null,null,null,null,"Mission score",{"$f":"(F15/8)*(VLOOKUP(F16,Donnés!$A$9:$B$12,2,FALSE)+VLOOKUP(F17,Donnés!$A$14:$B$15,2,FALSE))*F6","v":0}]
[null,null,null,null,"Mapping"]
[null,null,null,null,"Automatic Processing","NO"]
[null,null,null,null,"Images Inside House's Garage","NO"]
[null,null,null,null,"Images Inside Opened Storage","NO"]
[null,null,null,null,"Level of autonomy","Video based control"]
[null,null,null,null,"External aids","NO"]
[null,null,null,null,"In a row Bonus","NO"]
[null,null,null,null,"Mission score",{"$f":"(VLOOKUP(F21,Donnés!$E$7:$F$8,2,FALSE)+VLOOKUP(F22,Donnés!$E$10:$F$11,2,FALSE)+VLOOKUP(F23,Donnés!$E$13:$F$14,2,FALSE))*(VLOOKUP(F24,Donnés!$A$9:$B$12,2,FALSE)+VLOOKUP(F25,Donnés!$A$14:$B$15,2,FALSE))*F6","v":0}]
[null,null,null,null,"Target Detection"]
[null,null,null,null,"Clear view of the target","NO"]
[null,null,null,null,"Automatic Detection and Classification of The target","NO"]
[null,null,null,null,"Reading the data","NO"]
[null,null,null,null,"Level of autonomy","Video based control"]
[null,null,null,null,"External aids","NO"]
[null,null,null,null,"In a row Bonus","NO"]
[null,null,null,null,"Mission score",{"$f":"(VLOOKUP(F29,Donnés!$E$18:$F$19,2,FALSE)+VLOOKUP(F30,Donnés!$E$21:$F$22,2,FALSE)+VLOOKUP(F31,Donnés!$E$24:$F$25,2,FALSE))*(VLOOKUP(F32,Donnés!$A$9:$B$12,2,FALSE)+VLOOKUP(F33,Donnés!$A$14:$B$15,2,FALSE))*F6","v":0}]
[null,null,null,null,"Cooperative carrying"]
[null,null,null,null,"Number of MAVS if min distance is reached",0]
[null,null,null,null,"Precision landing of carried weight","NO"]
[null,null,null,null,"Weight","Light Weight"]
[null,null,null,null,"Level of autonomy","Video based control"]
[null,null,null,null,"External aids","NO"]
[null,null,null,null,"In a row Bonus","NO"]
[null,null,null,null,"Mission score",{"$f":"(F37*VLOOKUP(F39,Donnés!$H$28:$I$29,2,FALSE)+VLOOKUP(F38,Donnés!$E$28:$F$29,2,FALSE))*(VLOOKUP(F40,Donnés!$A$9:$B$12,2,FALSE)+VLOOKUP(F41,Donnés!$A$14:$B$15,2,FALSE))*F6","v":0}]
[null,null,null,null,"Landing (precision)"]
[null,null,null,null,"Landing ","NO"]
[null,null,null,null,"Extrapoints landing","NO"]
[null,null,null,null,"Level of autonomy","Video based control"]
[null,null,null,null,"External aids","NO"]
[null,null,null,null,"In a row Bonus","NO"]
[null,null,null,null,"Mission score",{"$f":"(VLOOKUP(F45,Donnés!$E$34:$F$37,2,FALSE)+VLOOKUP(F46,Donnés!$E$39:$F$40,2,FALSE))*(VLOOKUP(F47,Donnés!$A$9:$B$12,2,FALSE)+VLOOKUP(F48,Donnés!$A$14:$B$15,2,FALSE))*F6","v":0}]
[null,null,null,null,"Sum [MISSION ELEMENTS FACTOR (M) * LEVEL OF AUTONOMY (A)*SIZE (S)]"]
[null,null,null,null,"IN A ROW FACTOR"]
[null,null,null,null,"(I)"]
[null,null,null,null,"TOTAL POINTS MAV"]

{"sheet":"Donnés","index":2,"n_rows":40,"n_cols":9,"rows_kept":40,"cut":false,"hidden":true,"merged":[]}
["In a row factor","Factor (I)",null,null,"Automatic take off"]
[1,1,null,null,"YES",1]
[2,1.1000000000000001,null,null,"NO",0]
[3,1.2]
["4 (Max)",1.5,null,null,"Mapping"]
[null,null,null,null,"Automatic Processing"]
[null,null,null,null,"YES",2]
["Level of autonomy","Factor (A)",null,null,"NO",0]
["Video based control",1,null,null,"Images Inside House's Garage"]
["Autonomous Flight control",5,null,null,"YES",1]
["Autonomous Target Detection",5,null,null,"NO",0]
["Fully autonomous mission control",10,null,null,"Images Inside Opened Storage"]
[null,null,null,null,"YES",2]
["YES",-2,null,null,"NO",0]
["NO",0]
[null,null,null,null,"Target Detection"]
["Presentation Factor",null,null,null,"Clear view of the target"]
[0,1,null,null,"YES",1]
[0.01,1.01,null,null,"NO",0]
[0.02,1.02,null,null,"Automatic Detection and Classification of The target"]
[0.03,1.03,null,null,"YES",1]
[0.04,1.04,null,null,"NO",0]
[0.05,1.05,null,null,"Reading the data"]
[0.06,1.06,null,null,"YES",1]
[7.0000000000000007E-2,1.07,null,null,"NO",0]
[0.08,1.08]
[0.09,1.0900000000000001,null,null,"Precision landing weight",null,null,"Weight"]
[0.1,1.1000000000000001,null,null,"YES",1,null,"Light Weight",1]
[null,null,null,null,"NO",0,null,"Heavy Weight",3]
[]
["Bonus In a row"]
["YES",1]
["NO",0,null,null,"Landing"]
[null,null,null,null,"Precision Landing",2]
[null,null,null,null,"Normal Landing",1]
[null,null,null,null,"Field Landing",0]
[null,null,null,null,"NO",0]
[null,null,null,null,"Extrapoints landing"]
[null,null,null,null,"YES",1]
[null,null,null,null,"NO",0]